{"text_format":"1","workbook":"xlsx","n_sheets":9,"sheets":["Relatório de respostas 1","Relatório de sensibilidade 1","Sheet1","Relatório de respostas 2","Relatório de sensibilidade 2","Sheet2","Relatório de respostas 3","Relatório de sensibilidade 3","Sheet3"],"not_rendered":{"charts":0,"images":0,"macros":0,"external_links":0,"defined_names":108,"comments":0,"pivot_tables":0},"unopened":[],"bounds":{"document_bytes":16777216,"sheet_cells":100000,"rows_first":2000,"rows_last":500,"rows_between":2000,"halvings":0,"cell_chars":16384,"cell_head_chars":4096},"cells_cut":0,"cells_raw":0,"read":"whole","date_system":"1900"}

{"sheet":"Relatório de respostas 1","index":0,"n_rows":45,"n_cols":7,"rows_kept":45,"cut":false,"hidden":false,"merged":[]}
["Microsoft Excel 12.0 Relatório de respostas"]
["Folha de cálculo: [PERT-CPM - Ex. 1 - PL.xls]Sheet1"]
["Relatório gerado: 24-02-2013 15:14:39"]
[]
[]
["Célula de destino (Mín)"]
[null,"Célula","Nome","Valor original","Valor final"]
[null,"$J$19","Duração Acontecimento",0,44]
[]
[]
["Células ajustáveis"]
[null,"Célula","Nome","Valor original","Valor final"]
[null,"$J$5","≥ Acontecimento",0,0]
[null,"$J$6","≥ Acontecimento",0,2]
[null,"$J$7","≥ Acontecimento",0,6]
[null,"$J$8","≥ Acontecimento",0,16]
[null,"$J$9","≥ Acontecimento",0,22]
[null,"$J$10","≥ Acontecimento",0,20]
[null,"$J$11","≥ Acontecimento",0,33]
[null,"$J$12","≥ Acontecimento",0,42]
[null,"$J$13","≥ Acontecimento",0,25]
[null,"$J$14","≥ Acontecimento",0,33]
[null,"$J$15","≥ Acontecimento",0,38]
[null,"$J$16","≥ Acontecimento",0,38]
[null,"$J$17","≥ Acontecimento",0,44]
[]
[]
["Restrições"]
[null,"Célula","Nome","Valor da célula","Fórmula","Estado","Tolerância"]
[null,"$E$5","A(1,2) 1º Membro",2,"$E$5>=$G$5","Arquivar",0]
[null,"$E$6","B(2,3) 1º Membro",4,"$E$6>=$G$6","Arquivar",0]
[null,"$E$7","C(3,4) 1º Membro",10,"$E$7>=$G$7","Arquivar",0]
[null,"$E$8","D(4,5) 1º Membro",6,"$E$8>=$G$8","Arquivar",0]
[null,"$E$9","E(4,6) 1º Membro",4,"$E$9>=$G$9","Arquivar",0]
[null,"$E$10","Fic1(6,7) 1º Membro",13,"$E$10>=$G$10","Não arquivar",13]
[null,"$E$11","F(6,9) 1º Membro",5,"$E$11>=$G$11","Arquivar",0]
[null,"$E$12","G(5,7) 1º Membro",11,"$E$12>=$G$12","Não arquivar",4]
[null,"$E$13","H(7,8) 1º Membro",9,"$E$13>=$G$13","Arquivar",0]
[null,"$E$14","I(4,9) 1º Membro",9,"$E$14>=$G$14","Não arquivar",2]
[null,"$E$15","J(9,10) 1º Membro",8,"$E$15>=$G$15","Arquivar",0]
[null,"$E$16","K(10,11) 1º Membro",5,"$E$16>=$G$16","Não arquivar",1]
[null,"$E$17","Fic2(11,12) 1º Membro",0,"$E$17>=$G$17","Arquivar",0]
[null,"$E$18","L(10,12) 1º Membro",5,"$E$18>=$G$18","Arquivar",0]
[null,"$E$19","M(8,13) 1º Membro",2,"$E$19>=$G$19","Arquivar",0]
[null,"$E$20","N(12,13) 1º Membro",6,"$E$20>=$G$20","Arquivar",0]

{"sheet":"Relatório de sensibilidade 1","index":1,"n_rows":41,"n_cols":8,"rows_kept":41,"cut":false,"hidden":false,"merged":[]}
["Microsoft Excel 12.0 Relatório de sensibilidade"]
["Folha de cálculo: [PERT-CPM - Ex. 1 - PL.xls]Sheet1"]
["Relatório gerado: 24-02-2013 15:14:40"]
[]
[]
["Células ajustáveis"]
[null,null,null,"Final","Reduzido","Objectivo","Permissível","Permissível"]
[null,"Célula","Nome","Valor","Custo","Coêficiente","Aumentar","Diminuir"]
[null,"$J$5","≥ Acontecimento",0,0,-1,1E+30,0]
[null,"$J$6","≥ Acontecimento",2,0,0,1E+30,0]
[null,"$J$7","≥ Acontecimento",6,0,0,1E+30,0]
[null,"$J$8","≥ Acontecimento",16,0,0,1E+30,0]
[null,"$J$9","≥ Acontecimento",22,0,0,1E+30,0]
[null,"$J$10","≥ Acontecimento",20,0,0,1E+30,0]
[null,"$J$11","≥ Acontecimento",33,0,0,0,0]
[null,"$J$12","≥ Acontecimento",42,0,0,0,0]
[null,"$J$13","≥ Acontecimento",25,0,0,1E+30,0]
[null,"$J$14","≥ Acontecimento",33,0,0,1E+30,0]
[null,"$J$15","≥ Acontecimento",38,0,0,0,0]
[null,"$J$16","≥ Acontecimento",38,0,0,1E+30,0]
[null,"$J$17","≥ Acontecimento",44,0,1,1E+30,0]
[]
["Restrições"]
[null,null,null,"Final","Sombra","Restrição","Permissível","Permissível"]
[null,"Célula","Nome","Valor","Preço","Lado direito","Aumentar","Diminuir"]
[null,"$E$5","A(1,2) 1º Membro",2,1,2,1E+30,2]
[null,"$E$6","B(2,3) 1º Membro",4,1,4,1E+30,6]
[null,"$E$7","C(3,4) 1º Membro",10,1,10,1E+30,16]
[null,"$E$8","D(4,5) 1º Membro",6,0,6,4,22]
[null,"$E$9","E(4,6) 1º Membro",4,1,4,1E+30,2]
[null,"$E$10","Fic1(6,7) 1º Membro",13,0,0,13,1E+30]
[null,"$E$11","F(6,9) 1º Membro",5,1,5,1E+30,2]
[null,"$E$12","G(5,7) 1º Membro",11,0,7,4,1E+30]
[null,"$E$13","H(7,8) 1º Membro",9,0,9,4,1E+30]
[null,"$E$14","I(4,9) 1º Membro",9,0,7,2,1E+30]
[null,"$E$15","J(9,10) 1º Membro",8,1,8,1E+30,4]
[null,"$E$16","K(10,11) 1º Membro",5,0,4,1,1E+30]
[null,"$E$17","Fic2(11,12) 1º Membro",0,0,0,1,1E+30]
[null,"$E$18","L(10,12) 1º Membro",5,1,5,1E+30,1]
[null,"$E$19","M(8,13) 1º Membro",2,0,2,4,1E+30]
[null,"$E$20","N(12,13) 1º Membro",6,1,6,1E+30,4]

{"sheet":"Sheet1","index":2,"n_rows":20,"n_cols":11,"rows_kept":20,"cut":false,"hidden":false,"merged":[]}
["Cap. 1 - Exercício 1.  Projecto da RELIABLE CONSTRUCTION. PL"]
[]
[null,null,null,null,"Restrições",null,null,"Natureza ",null,"Ocorrência"]
[null,"Activid.","De","Para","1º Membro","Sinal","Duração","Actividade","Acontecimento","Acontecimento"]
[null,"A(1,2)",1,2,{"$f":"+J6-J5","v":2},"≥",2,{"$f":"IF('Relatório de sensibilidade 1'!E26=1, \"Crítica\",\"Não crítica\")","v":"Crítica"},1,0]
[null,"B(2,3)",2,3,{"$f":"+J7-J6","v":4},"≥",4,{"$f":"IF('Relatório de sensibilidade 1'!E27=1, \"Crítica\",\"Não crítica\")","v":"Crítica"},{"$f":"+I5+1","v":2},2]
[null,"C(3,4)",3,4,{"$f":"+J8-J7","v":10},"≥",10,{"$f":"IF('Relatório de sensibilidade 1'!E28=1, \"Crítica\",\"Não crítica\")","v":"Crítica"},{"$f":"+I6+1","v":3},6]
[null,"D(4,5)",4,5,{"$f":"+J9-J8","v":6},"≥",6,{"$f":"IF('Relatório de sensibilidade 1'!E29=1, \"Crítica\",\"Não crítica\")","v":"Não crítica"},4,16]
[null,"E(4,6)",4,6,{"$f":"+J10-J8","v":4},"≥",4,{"$f":"IF('Relatório de sensibilidade 1'!E30=1, \"Crítica\",\"Não crítica\")","v":"Crítica"},5,22]
[null,"Fic1(6,7)",6,7,{"$f":"+J11-J10","v":13},"≥",0,{"$f":"IF('Relatório de sensibilidade 1'!E31=1, \"Crítica\",\"Não crítica\")","v":"Não crítica"},6,20]
[null,"F(6,9)",6,9,{"$f":"+J13-J10","v":5},"≥",5,{"$f":"IF('Relatório de sensibilidade 1'!E32=1, \"Crítica\",\"Não crítica\")","v":"Crítica"},7,33]
[null,"G(5,7)",5,7,{"$f":"+J11-J9","v":11},"≥",7,{"$f":"IF('Relatório de sensibilidade 1'!E33=1, \"Crítica\",\"Não crítica\")","v":"Não crítica"},8,42]
[null,"H(7,8)",7,8,{"$f":"+J12-J11","v":9},"≥",9,{"$f":"IF('Relatório de sensibilidade 1'!E34=1, \"Crítica\",\"Não crítica\")","v":"Não crítica"},9,25]
[null,"I(4,9)",4,9,{"$f":"+J13-J8","v":9},"≥",7,{"$f":"IF('Relatório de sensibilidade 1'!E35=1, \"Crítica\",\"Não crítica\")","v":"Não crítica"},10,33]
[null,"J(9,10)",9,10,{"$f":"+J14-J13","v":8},"≥",8,{"$f":"IF('Relatório de sensibilidade 1'!E36=1, \"Crítica\",\"Não crítica\")","v":"Crítica"},11,38]
[null,"K(10,11)",10,11,{"$f":"+J15-J14","v":5},"≥",4,{"$f":"IF('Relatório de sensibilidade 1'!E37=1, \"Crítica\",\"Não crítica\")","v":"Não crítica"},12,38]
[null,"Fic2(11,12)",11,12,{"$f":"+J16-J15","v":0},"≥",0,{"$f":"IF('Relatório de sensibilidade 1'!E38=1, \"Crítica\",\"Não crítica\")","v":"Não crítica"},{"$f":"+I16+1","v":13},44]
[null,"L(10,12)",10,12,{"$f":"+J16-J14","v":5},"≥",5,{"$f":"IF('Relatório de sensibilidade 1'!E39=1, \"Crítica\",\"Não crítica\")","v":"Crítica"}]
[null,"M(8,13)",8,13,{"$f":"+J17-J12","v":2},"≥",2,{"$f":"IF('Relatório de sensibilidade 1'!E40=1, \"Crítica\",\"Não crítica\")","v":"Não crítica"},"Duração",{"$f":"+J17-J5","v":44},"Semanas"]
[null,"N(12,13)",12,13,{"$f":"+J17-J16","v":6},"≥",6,{"$f":"IF('Relatório de sensibilidade 1'!E41=1, \"Crítica\",\"Não crítica\")","v":"Crítica"}]

{"sheet":"Relatório de respostas 2","index":3,"n_rows":78,"n_cols":7,"rows_kept":78,"cut":false,"hidden":false,"merged":[]}
["Microsoft Excel 12.0 Relatório de respostas"]
["Folha de cálculo: [Cópia de Cópia de PERT-CPM - Ex. 1 - PL.xls]Sheet2"]
["Relatório gerado: 24-02-2013 17:19:36"]
[]
[]
["Célula de destino (Máx)"]
[null,"Célula","Nome","Valor original","Valor final"]
[null,"$M$22","L. Adicional Acontecimento",1175,75]
[]
[]
["Células ajustáveis"]
[null,"Célula","Nome","Valor original","Valor final"]
[null,"$F$5","A(1,2) Aceleração",0,0]
[null,"$F$6","B(2,3) Aceleração",0,0]
[null,"$F$7","C(3,4) Aceleração",0,0]
[null,"$F$8","D(4,5) Aceleração",0,0]
[null,"$F$9","E(4,6) Aceleração",0,0]
[null,"$F$10","Fic1(6,7) Aceleração",0,0]
[null,"$F$11","F(6,9) Aceleração",0,0]
[null,"$F$12","G(5,7) Aceleração",0,0]
[null,"$F$13","H(7,8) Aceleração",0,0]
[null,"$F$14","I(4,9) Aceleração",0,0]
[null,"$F$15","J(9,10) Aceleração",0,0]
[null,"$F$16","K(10,11) Aceleração",0,0]
[null,"$F$17","Fic2(11,12) Aceleração",0,0]
[null,"$F$18","L(10,12) Aceleração",0,0]
[null,"$F$19","M(8,13) Aceleração",0,0]
[null,"$F$20","N(12,13) Aceleração",0,0]
[null,"$M$5","A(1,2) Acontecimento",0,0]
[null,"$M$6","B(2,3) Acontecimento",0,2]
[null,"$M$7","C(3,4) Acontecimento",0,6]
[null,"$M$8","D(4,5) Acontecimento",0,16]
[null,"$M$9","E(4,6) Acontecimento",0,26]
[null,"$M$10","Fic1(6,7) Acontecimento",0,20]
[null,"$M$11","F(6,9) Acontecimento",0,33]
[null,"$M$12","G(5,7) Acontecimento",0,42]
[null,"$M$13","H(7,8) Acontecimento",0,25]
[null,"$M$14","I(4,9) Acontecimento",0,33]
[null,"$M$15","J(9,10) Acontecimento",0,38]
[null,"$M$16","K(10,11) Acontecimento",0,38]
[null,"$M$17","Fic2(11,12) Acontecimento",0,44]
[]
[]
["Restrições"]
[null,"Célula","Nome","Valor da célula","Fórmula","Estado","Tolerância"]
[null,"$K$5","A(1,2) 1º Membro",2,"$K$5>=$C$5","Arquivar",0]
[null,"$K$6","B(2,3) 1º Membro",4,"$K$6>=$C$6","Arquivar",0]
[null,"$K$7","C(3,4) 1º Membro",10,"$K$7>=$C$7","Arquivar",0]
[null,"$K$8","D(4,5) 1º Membro",10,"$K$8>=$C$8","Não arquivar",4]
[null,"$K$9","E(4,6) 1º Membro",4,"$K$9>=$C$9","Arquivar",0]
[null,"$K$10","Fic1(6,7) 1º Membro",13,"$K$10>=$C$10","Não arquivar",13]
[null,"$K$11","F(6,9) 1º Membro",5,"$K$11>=$C$11","Arquivar",0]
[null,"$K$12","G(5,7) 1º Membro",7,"$K$12>=$C$12","Arquivar",0]
[null,"$K$13","H(7,8) 1º Membro",9,"$K$13>=$C$13","Arquivar",0]
[null,"$K$14","I(4,9) 1º Membro",41,"$K$14>=$C$14","Não arquivar",34]
[null,"$K$15","J(9,10) 1º Membro",8,"$K$15>=$C$15","Arquivar",0]
[null,"$K$16","K(10,11) 1º Membro",5,"$K$16>=$C$16","Não arquivar",1]
[null,"$K$17","Fic2(11,12) 1º Membro",0,"$K$17>=$C$17","Arquivar",0]
[null,"$K$18","L(10,12) 1º Membro",5,"$K$18>=$C$18","Arquivar",0]
[null,"$K$19","M(8,13) 1º Membro",2,"$K$19>=$C$19","Arquivar",0]
[null,"$K$20","N(12,13) 1º Membro",6,"$K$20>=$C$20","Arquivar",0]
[null,"$K$21","Tempo total 1º Membro",44,"$K$21<=$M$19","Não arquivar",3]
[null,"$F$5","A(1,2) Aceleração",0,"$F$5<=$E$5","Não arquivar",1]
[null,"$F$6","B(2,3) Aceleração",0,"$F$6<=$E$6","Não arquivar",2]
[null,"$F$7","C(3,4) Aceleração",0,"$F$7<=$E$7","Não arquivar",3]
[null,"$F$8","D(4,5) Aceleração",0,"$F$8<=$E$8","Não arquivar",2]
[null,"$F$9","E(4,6) Aceleração",0,"$F$9<=$E$9","Não arquivar",1]
[null,"$F$10","Fic1(6,7) Aceleração",0,"$F$10<=$E$10","Arquivar",0]
[null,"$F$11","F(6,9) Aceleração",0,"$F$11<=$E$11","Não arquivar",2]
[null,"$F$12","G(5,7) Aceleração",0,"$F$12<=$E$12","Não arquivar",3]
[null,"$F$13","H(7,8) Aceleração",0,"$F$13<=$E$13","Não arquivar",3]
[null,"$F$14","I(4,9) Aceleração",0,"$F$14<=$E$14","Não arquivar",2]
[null,"$F$15","J(9,10) Aceleração",0,"$F$15<=$E$15","Não arquivar",2]
[null,"$F$16","K(10,11) Aceleração",0,"$F$16<=$E$16","Não arquivar",1]
[null,"$F$17","Fic2(11,12) Aceleração",0,"$F$17<=$E$17","Arquivar",0]
[null,"$F$18","L(10,12) Aceleração",0,"$F$18<=$E$18","Não arquivar",2]
[null,"$F$19","M(8,13) Aceleração",0,"$F$19<=$E$19","Não arquivar",1]
[null,"$F$20","N(12,13) Aceleração",0,"$F$20<=$E$20","Não arquivar",3]

{"sheet":"Relatório de sensibilidade 2","index":4,"n_rows":58,"n_cols":8,"rows_kept":58,"cut":false,"hidden":false,"merged":[]}
["Microsoft Excel 12.0 Relatório de sensibilidade"]
["Folha de cálculo: [Cópia de Cópia de PERT-CPM - Ex. 1 - PL.xls]Sheet2"]
["Relatório gerado: 24-02-2013 17:19:37"]
[]
[]
["Células ajustáveis"]
[null,null,null,"Final","Reduzido","Objectivo","Permissível","Permissível"]
[null,"Célula","Nome","Valor","Custo","Coêficiente","Aumentar","Diminuir"]
[null,"$F$5","A(1,2) Aceleração",0,-74.999999992542129,-99.9999999976353,74.999999992542129,1E+30]
[null,"$F$6","B(2,3) Aceleração",0,-25.000000005093167,-50.000000010186334,25.000000005093167,1E+30]
[null,"$F$7","C(3,4) Aceleração",0,-54.999999997562554,-80.000000002655725,54.999999997562554,1E+30]
[null,"$F$8","D(4,5) Aceleração",0,-39.999999989959178,-39.999999989959178,39.999999989959178,1E+30]
[null,"$F$9","E(4,6) Aceleração",0,-135.00000000021828,-160.00000000531145,135.00000000021828,1E+30]
[null,"$F$10","Fic1(6,7) Aceleração",0,0,0,0,1E+30]
[null,"$F$11","F(6,9) Aceleração",0,-14.999999984866012,-39.999999989959178,14.999999984866012,1E+30]
[null,"$F$12","G(5,7) Aceleração",0,-39.999999989959178,-39.999999989959178,39.999999989959178,1E+30]
[null,"$F$13","H(7,8) Aceleração",0,-60.000000007676135,-60.000000007676128,60.000000007676135,1E+30]
[null,"$F$14","I(4,9) Aceleração",0,-29.999999992469384,-29.99999999246938,29.999999992469384,1E+30]
[null,"$F$15","J(9,10) Aceleração",0,-4.9999999873762153,-29.99999999246938,4.9999999873762153,1E+30]
[null,"$F$16","K(10,11) Aceleração",0,-39.999999989959186,-39.999999989959178,39.999999989959186,1E+30]
[null,"$F$17","Fic2(11,12) Aceleração",0,0,0,0,1E+30]
[null,"$F$18","L(10,12) Aceleração",0,-25.000000005093163,-50.000000010186334,25.000000005093163,1E+30]
[null,"$F$19","M(8,13) Aceleração",0,-99.9999999976353,-99.9999999976353,99.9999999976353,1E+30]
[null,"$F$20","N(12,13) Aceleração",0,-35.000000002582965,-60.000000007676128,35.000000002582965,1E+30]
[null,"$M$5","A(1,2) Acontecimento",0,-25.000000005093167,0,25.000000005093167,1E+30]
[null,"$M$6","B(2,3) Acontecimento",2,0,0,25.000000005093167,74.999999992542129]
[null,"$M$7","C(3,4) Acontecimento",6,0,0,25.000000005093167,25.000000005093167]
[null,"$M$8","D(4,5) Acontecimento",16,0,0,25.000000005093167,25.000000005093167]
[null,"$M$9","E(4,6) Acontecimento",26,0,0,25.000000005093167,0]
[null,"$M$10","Fic1(6,7) Acontecimento",20,0,0,25.000000005093167,25.000000005093167]
[null,"$M$11","F(6,9) Acontecimento",33,0,0,25.000000005093167,0]
[null,"$M$12","G(5,7) Acontecimento",42,0,0,25.000000005093167,0]
[null,"$M$13","H(7,8) Acontecimento",25,0,0,25.000000005093167,14.999999984866012]
[null,"$M$14","I(4,9) Acontecimento",33,0,0,25.000000005093167,4.9999999873762153]
[null,"$M$15","J(9,10) Acontecimento",38,0,0,0,0]
[null,"$M$16","K(10,11) Acontecimento",38,0,0,25.000000005093167,4.9999999873762153]
[null,"$M$17","Fic2(11,12) Acontecimento",44,0,-25.000000005093167,25.000000005093167,4.9999999873762153]
[]
["Restrições"]
[null,null,null,"Final","Sombra","Restrição","Permissível","Permissível"]
[null,"Célula","Nome","Valor","Preço","Lado direito","Aumentar","Diminuir"]
[null,"$K$5","A(1,2) 1º Membro",2,-25.000000005093167,2,3,2]
[null,"$K$6","B(2,3) 1º Membro",4,-25.000000005093167,4,3,6]
[null,"$K$7","C(3,4) 1º Membro",10,-25.000000005093167,10,3,16]
[null,"$K$8","D(4,5) 1º Membro",10,0,6,4,1E+30]
[null,"$K$9","E(4,6) 1º Membro",4,-25.000000005093167,4,3,4]
[null,"$K$10","Fic1(6,7) 1º Membro",13,0,0,13,1E+30]
[null,"$K$11","F(6,9) 1º Membro",5,-25.000000005093167,5,3,4]
[null,"$K$12","G(5,7) 1º Membro",7,0,7,4,1E+30]
[null,"$K$13","H(7,8) 1º Membro",9,0,9,4,1E+30]
[null,"$K$14","I(4,9) 1º Membro",41,0,7,34,1E+30]
[null,"$K$15","J(9,10) 1º Membro",8,-25.000000005093167,8,3,4]
[null,"$K$16","K(10,11) 1º Membro",5,0,4,1,1E+30]
[null,"$K$17","Fic2(11,12) 1º Membro",0,0,0,1,1E+30]
[null,"$K$18","L(10,12) 1º Membro",5,-25.000000005093167,5,3,1]
[null,"$K$19","M(8,13) 1º Membro",2,0,2,4,1E+30]
[null,"$K$20","N(12,13) 1º Membro",6,-25.000000005093167,6,3,4]
[null,"$K$21","Tempo total 1º Membro",44,0,47,1E+30,3]

{"sheet":"Sheet2","index":5,"n_rows":23,"n_cols":13,"rows_kept":23,"cut":false,"hidden":false,"merged":[]}
["Cap. 1 - Exercício 1.  Projecto da RELIABLE CONSTRUCTION. j)"]
[]
[null,null,"Duração","(semanas)","Aceleração ",null,"Duração ","                  Custo (1000$)",null,"Custo Aceler.","Restrições",null,"Ocorrência"]
[null,"Activid.","Normal","Acelerada","Máxima","Aceleração","Óptima","Normal","Acelerado","Unit. ($)","1º Membro","Acontecimento","Acontecimento"]
[null,"A(1,2)",2,1,{"$f":"+C5-D5","v":1},0,{"$f":"+C5-F5","v":2},180,280,{"$f":"+(I5-H5)/E5","v":100},{"$f":"+M6-M5+F5","v":2},1,0]
[null,"B(2,3)",4,2,2,0,{"$f":"+C6-F6","v":4},320,420,{"$f":"+(I6-H6)/E6","v":50},{"$f":"+M7-M6+F6","v":4},{"$f":"+L5+1","v":2},2]
[null,"C(3,4)",10,7,3,0,10,620,860,{"$f":"+(I7-H7)/E7","v":80},{"$f":"+M8-M7+F7","v":10},{"$f":"+L6+1","v":3},6]
[null,"D(4,5)",6,4,2,0,6,260,340,{"$f":"+(I8-H8)/E8","v":40},{"$f":"+M9-M8+F8","v":10},4,16]
[null,"E(4,6)",4,3,1,0,4,410,570,{"$f":"+(I9-H9)/E9","v":160},{"$f":"+M10-M8+F9","v":4},5,26]
[null,"Fic1(6,7)",0,0,0,0,0,0,0,0,{"$f":"+M11-M10+F10","v":13},6,20]
[null,"F(6,9)",5,3,2,0,5,180,260,{"$f":"+(I11-H11)/E11","v":40},{"$f":"+M13-M10+F11","v":5},7,33]
[null,"G(5,7)",7,4,3,0,7,900,1020,40,{"$f":"+M11-M9+F12","v":7},8,42]
[null,"H(7,8)",9,6,3,0,9,200,380,60,{"$f":"+M12-M11+F13","v":9},9,25]
[null,"I(4,9)",7,5,2,0,7,210,270,30,{"$f":"+M13+M8+F14","v":41},10,33]
[null,"J(9,10)",8,6,2,0,8,430,490,30,{"$f":"+M14-M13+F15","v":8},11,38]
[null,"K(10,11)",4,3,1,0,4,160,200,40,{"$f":"+M15-M14+F16","v":5},12,38]
[null,"Fic2(11,12)",0,0,0,0,0,0,0,0,{"$f":"+M16-M15+F17","v":0},13,44]
[null,"L(10,12)",5,3,{"$f":"+C18-D18","v":2},0,5,250,350,{"$f":"+(I18-H18)/E18","v":50},{"$f":"+M16-M14+F18","v":5}]
[null,"M(8,13)",2,1,{"$f":"+C19-D19","v":1},0,2,100,200,{"$f":"+(I19-H19)/E19","v":100},{"$f":"+M17-M12+F19","v":2},"Dur. referência",47]
[null,"N(12,13)",6,3,{"$f":"+C20-D20","v":3},0,6,330,510,{"$f":"+(I20-H20)/E20","v":60},{"$f":"+M17-M16+F20","v":6},"Bonus Unit",25]
[null,null,null,null,null,null,null,null,null,"Tempo total",{"$f":"+M17-M5","v":44}]
[null,null,null,null,null,null,null,null,null,null,null,"Lucro total",{"$f":"5400+M20*(M19-M17)-SUMPRODUCT(J5:J20,F5:F20)","v":5475}]
[null,null,null,null,null,null,null,null,null,null,null,"Lucro Adicional",{"$f":"+M22-5400","v":75}]

{"sheet":"Relatório de respostas 3","index":6,"n_rows":78,"n_cols":7,"rows_kept":78,"cut":false,"hidden":false,"merged":[]}
["Microsoft Excel 12.0 Relatório de respostas"]
["Folha de cálculo: [PERT-CPM - Ex. 1 - PL.xls]Sheet3"]
["Relatório gerado: 24-02-2013 17:38:17"]
[]
[]
["Célula de destino (Mín)"]
[null,"Célula","Nome","Valor original","Valor final"]
[null,"$M$22","Custo mínimo Acontecimento",0,140]
[]
[]
["Células ajustáveis"]
[null,"Célula","Nome","Valor original","Valor final"]
[null,"$F$5","A(1,2) Aceleração",0,0]
[null,"$F$6","B(2,3) Aceleração",0,0]
[null,"$F$7","C(3,4) Aceleração",0,0]
[null,"$F$8","D(4,5) Aceleração",0,0]
[null,"$F$9","E(4,6) Aceleração",0,0]
[null,"$F$10","Fic1(6,7) Aceleração",0,0]
[null,"$F$11","F(6,9) Aceleração",0,2]
[null,"$F$12","G(5,7) Aceleração",0,0]
[null,"$F$13","H(7,8) Aceleração",0,0]
[null,"$F$14","I(4,9) Aceleração",0,0]
[null,"$F$15","J(9,10) Aceleração",0,2]
[null,"$F$16","K(10,11) Aceleração",0,0]
[null,"$F$17","Fic2(11,12) Aceleração",0,0]
[null,"$F$18","L(10,12) Aceleração",0,0]
[null,"$F$19","M(8,13) Aceleração",0,0]
[null,"$F$20","N(12,13) Aceleração",0,0]
[null,"$M$5","A(1,2) Acontecimento",0,0]
[null,"$M$6","B(2,3) Acontecimento",0,2]
[null,"$M$7","C(3,4) Acontecimento",0,6]
[null,"$M$8","D(4,5) Acontecimento",0,16]
[null,"$M$9","E(4,6) Acontecimento",0,22]
[null,"$M$10","Fic1(6,7) Acontecimento",0,20]
[null,"$M$11","F(6,9) Acontecimento",0,29]
[null,"$M$12","G(5,7) Acontecimento",0,38]
[null,"$M$13","H(7,8) Acontecimento",0,23]
[null,"$M$14","I(4,9) Acontecimento",0,29]
[null,"$M$15","J(9,10) Acontecimento",0,34]
[null,"$M$16","K(10,11) Acontecimento",0,34]
[null,"$M$17","Fic2(11,12) Acontecimento",0,40]
[]
[]
["Restrições"]
[null,"Célula","Nome","Valor da célula","Fórmula","Estado","Tolerância"]
[null,"$K$5","A(1,2) 1º Membro",2,"$K$5>=$C$5","Arquivar",0]
[null,"$K$6","B(2,3) 1º Membro",4,"$K$6>=$C$6","Arquivar",0]
[null,"$K$7","C(3,4) 1º Membro",10,"$K$7>=$C$7","Arquivar",0]
[null,"$K$8","D(4,5) 1º Membro",6,"$K$8>=$C$8","Arquivar",0]
[null,"$K$9","E(4,6) 1º Membro",4,"$K$9>=$C$9","Arquivar",0]
[null,"$K$10","Fic1(6,7) 1º Membro",9,"$K$10>=$C$10","Não arquivar",9]
[null,"$K$11","F(6,9) 1º Membro",5,"$K$11>=$C$11","Arquivar",0]
[null,"$K$12","G(5,7) 1º Membro",7,"$K$12>=$C$12","Arquivar",0]
[null,"$K$13","H(7,8) 1º Membro",9,"$K$13>=$C$13","Arquivar",0]
[null,"$K$14","I(4,9) 1º Membro",39,"$K$14>=$C$14","Não arquivar",32]
[null,"$K$15","J(9,10) 1º Membro",8,"$K$15>=$C$15","Arquivar",0]
[null,"$K$16","K(10,11) 1º Membro",5,"$K$16>=$C$16","Não arquivar",1]
[null,"$K$17","Fic2(11,12) 1º Membro",0,"$K$17>=$C$17","Arquivar",0]
[null,"$K$18","L(10,12) 1º Membro",5,"$K$18>=$C$18","Arquivar",0]
[null,"$K$19","M(8,13) 1º Membro",2,"$K$19>=$C$19","Arquivar",0]
[null,"$K$20","N(12,13) 1º Membro",6,"$K$20>=$C$20","Arquivar",0]
[null,"$K$21","Tempo total 1º Membro",40,"$K$21<=$M$19","Arquivar",0]
[null,"$F$5","A(1,2) Aceleração",0,"$F$5<=$E$5","Não arquivar",1]
[null,"$F$6","B(2,3) Aceleração",0,"$F$6<=$E$6","Não arquivar",2]
[null,"$F$7","C(3,4) Aceleração",0,"$F$7<=$E$7","Não arquivar",3]
[null,"$F$8","D(4,5) Aceleração",0,"$F$8<=$E$8","Não arquivar",2]
[null,"$F$9","E(4,6) Aceleração",0,"$F$9<=$E$9","Não arquivar",1]
[null,"$F$10","Fic1(6,7) Aceleração",0,"$F$10<=$E$10","Arquivar",0]
[null,"$F$11","F(6,9) Aceleração",2,"$F$11<=$E$11","Arquivar",0]
[null,"$F$12","G(5,7) Aceleração",0,"$F$12<=$E$12","Não arquivar",3]
[null,"$F$13","H(7,8) Aceleração",0,"$F$13<=$E$13","Não arquivar",3]
[null,"$F$14","I(4,9) Aceleração",0,"$F$14<=$E$14","Não arquivar",2]
[null,"$F$15","J(9,10) Aceleração",2,"$F$15<=$E$15","Arquivar",0]
[null,"$F$16","K(10,11) Aceleração",0,"$F$16<=$E$16","Não arquivar",1]
[null,"$F$17","Fic2(11,12) Aceleração",0,"$F$17<=$E$17","Arquivar",0]
[null,"$F$18","L(10,12) Aceleração",0,"$F$18<=$E$18","Não arquivar",2]
[null,"$F$19","M(8,13) Aceleração",0,"$F$19<=$E$19","Não arquivar",1]
[null,"$F$20","N(12,13) Aceleração",0,"$F$20<=$E$20","Não arquivar",3]

{"sheet":"Relatório de sensibilidade 3","index":7,"n_rows":58,"n_cols":8,"rows_kept":58,"cut":false,"hidden":false,"merged":[]}
["Microsoft Excel 12.0 Relatório de sensibilidade"]
["Folha de cálculo: [PERT-CPM - Ex. 1 - PL.xls]Sheet3"]
["Relatório gerado: 24-02-2013 17:38:18"]
[]
[]
["Células ajustáveis"]
[null,null,null,"Final","Reduzido","Objectivo","Permissível","Permissível"]
[null,"Célula","Nome","Valor","Custo","Coêficiente","Aumentar","Diminuir"]
[null,"$F$5","A(1,2) Aceleração",0,50,100,1E+30,50]
[null,"$F$6","B(2,3) Aceleração",0,0,50,1E+30,0]
[null,"$F$7","C(3,4) Aceleração",0,30,80,1E+30,30]
[null,"$F$8","D(4,5) Aceleração",0,40,40,1E+30,40]
[null,"$F$9","E(4,6) Aceleração",0,110,160,1E+30,110]
[null,"$F$10","Fic1(6,7) Aceleração",0,0,0,1E+30,0]
[null,"$F$11","F(6,9) Aceleração",2,-10,40,10,1E+30]
[null,"$F$12","G(5,7) Aceleração",0,40,40,1E+30,40]
[null,"$F$13","H(7,8) Aceleração",0,60,60,1E+30,60]
[null,"$F$14","I(4,9) Aceleração",0,30,30,1E+30,30]
[null,"$F$15","J(9,10) Aceleração",2,-20,30,20,1E+30]
[null,"$F$16","K(10,11) Aceleração",0,40,40,1E+30,40]
[null,"$F$17","Fic2(11,12) Aceleração",0,0,0,1E+30,0]
[null,"$F$18","L(10,12) Aceleração",0,0,50,0,10]
[null,"$F$19","M(8,13) Aceleração",0,100,100,1E+30,100]
[null,"$F$20","N(12,13) Aceleração",0,10,60,1E+30,10]
[null,"$M$5","A(1,2) Acontecimento",0,0,0,1E+30,0]
[null,"$M$6","B(2,3) Acontecimento",2,0,0,50,0]
[null,"$M$7","C(3,4) Acontecimento",6,0,0,0,0]
[null,"$M$8","D(4,5) Acontecimento",16,0,0,0,0]
[null,"$M$9","E(4,6) Acontecimento",22,0,0,0,0]
[null,"$M$10","Fic1(6,7) Acontecimento",20,0,0,0,0]
[null,"$M$11","F(6,9) Acontecimento",29,0,0,0,0]
[null,"$M$12","G(5,7) Acontecimento",38,0,0,0,0]
[null,"$M$13","H(7,8) Acontecimento",23,0,0,0,0]
[null,"$M$14","I(4,9) Acontecimento",29,0,0,0,0]
[null,"$M$15","J(9,10) Acontecimento",34,0,0,0,0]
[null,"$M$16","K(10,11) Acontecimento",34,0,0,50,0]
[null,"$M$17","Fic2(11,12) Acontecimento",40,0,0,50,0]
[]
["Restrições"]
[null,null,null,"Final","Sombra","Restrição","Permissível","Permissível"]
[null,"Célula","Nome","Valor","Preço","Lado direito","Aumentar","Diminuir"]
[null,"$K$5","A(1,2) 1º Membro",2,50,2,0,0]
[null,"$K$6","B(2,3) 1º Membro",4,50,4,0,0]
[null,"$K$7","C(3,4) 1º Membro",10,50,10,0,0]
[null,"$K$8","D(4,5) 1º Membro",6,0,6,0,1E+30]
[null,"$K$9","E(4,6) 1º Membro",4,50,4,1,0]
[null,"$K$10","Fic1(6,7) 1º Membro",9,0,0,9,1E+30]
[null,"$K$11","F(6,9) 1º Membro",5,50,5,1,0]
[null,"$K$12","G(5,7) 1º Membro",7,0,7,0,1E+30]
[null,"$K$13","H(7,8) 1º Membro",9,0,9,0,1E+30]
[null,"$K$14","I(4,9) 1º Membro",39,0,7,32,1E+30]
[null,"$K$15","J(9,10) 1º Membro",8,50,8,1,0]
[null,"$K$16","K(10,11) 1º Membro",5,0,4,1,1E+30]
[null,"$K$17","Fic2(11,12) 1º Membro",0,0,0,1,1E+30]
[null,"$K$18","L(10,12) 1º Membro",5,50,5,2,0]
[null,"$K$19","M(8,13) 1º Membro",2,0,2,0,1E+30]
[null,"$K$20","N(12,13) 1º Membro",6,50,6,1,0]
[null,"$K$21","Tempo total 1º Membro",40,-50,40,0,0]

{"sheet":"Sheet3","index":8,"n_rows":24,"n_cols":13,"rows_kept":24,"cut":false,"hidden":false,"merged":[]}
["Cap. 1 - Exercício 1.  Projecto da RELIABLE CONSTRUCTION. i)"]
[]
[null,null,"Duração","(semanas)","Aceleração ",null,"Duração ","                  Custo (1000$)",null,"Custo Aceler.","Restrições",null,"Ocorrência"]
[null,"Activid.","Normal","Acelerada","Máxima","Aceleração","Óptima","Normal","Acelerado","Unit. ($)","1º Membro","Acontecimento","Acontecimento"]
[null,"A(1,2)",2,1,{"$f":"+C5-D5","v":1},0,{"$f":"+C5-F5","v":2},180,280,{"$f":"+(I5-H5)/E5","v":100},{"$f":"+M6-M5+F5","v":2},1,0]
[null,"B(2,3)",4,2,2,0,{"$f":"+C6-F6","v":4},320,420,{"$f":"+(I6-H6)/E6","v":50},{"$f":"+M7-M6+F6","v":4},{"$f":"+L5+1","v":2},2]
[null,"C(3,4)",10,7,3,0,10,620,860,{"$f":"+(I7-H7)/E7","v":80},{"$f":"+M8-M7+F7","v":10},{"$f":"+L6+1","v":3},6]
[null,"D(4,5)",6,4,2,0,6,260,340,{"$f":"+(I8-H8)/E8","v":40},{"$f":"+M9-M8+F8","v":6},4,16]
[null,"E(4,6)",4,3,1,0,4,410,570,{"$f":"+(I9-H9)/E9","v":160},{"$f":"+M10-M8+F9","v":4},5,22]
[null,"Fic1(6,7)",0,0,0,0,0,0,0,0,{"$f":"+M11-M10+F10","v":9},6,20]
[null,"F(6,9)",5,3,2,1.999999999999996,3.000000000000004,180,260,{"$f":"+(I11-H11)/E11","v":40},{"$f":"+M13-M10+F11","v":5},7,29]
[null,"G(5,7)",7,4,3,0,7,900,1020,40,{"$f":"+M11-M9+F12","v":7},8,38]
[null,"H(7,8)",9,6,3,0,9,200,380,60,{"$f":"+M12-M11+F13","v":9},9,23.000000000000004]
[null,"I(4,9)",7,5,2,0,7,210,270,30,{"$f":"+M13+M8+F14","v":39},10,29.000000000000004]
[null,"J(9,10)",8,6,2,2,6,430,490,30,{"$f":"+M14-M13+F15","v":8},11,34.000000000000021]
[null,"K(10,11)",4,3,1,0,4,160,200,40,{"$f":"+M15-M14+F16","v":5.0000000000000178},12,34.000000000000014]
[null,"Fic2(11,12)",0,0,0,0,0,0,0,0,{"$f":"+M16-M15+F17","v":-7.1054273576010019E-15},13,40]
[null,"L(10,12)",5,3,{"$f":"+C18-D18","v":2},0,5,250,350,{"$f":"+(I18-H18)/E18","v":50},{"$f":"+M16-M14+F18","v":5.0000000000000107},null,1]
[null,"M(8,13)",2,1,{"$f":"+C19-D19","v":1},0,2,100,200,{"$f":"+(I19-H19)/E19","v":100},{"$f":"+M17-M12+F19","v":2},"Dur. referência",40]
[null,"N(12,13)",6,3,{"$f":"+C20-D20","v":3},0,6,330,510,{"$f":"+(I20-H20)/E20","v":60},{"$f":"+M17-M16+F20","v":5.9999999999999858},"Bonus Unit",150]
[null,null,null,null,null,null,null,null,null,"Tempo total",{"$f":"+M17-M5","v":40}]
[null,null,null,null,null,null,null,null,null,null,null,"Custo mínimo",{"$f":"SUMPRODUCT(J5:J20,F5:F20)","v":139.99999999999983}]
[]
[null,null,null,null,null,null,null,null,null,null,null,"Lucro adicional",{"$f":"+M20*M18-M22","v":10.000000000000171}]